{"text_format":"1","workbook":"xlsx","n_sheets":2,"sheets":["Cleanse","Moon"],"not_rendered":{"charts":0,"images":5,"macros":1,"external_links":0,"defined_names":2,"comments":0,"pivot_tables":0},"unopened":[],"bounds":{"document_bytes":16777216,"sheet_cells":100000,"rows_first":2000,"rows_last":500,"rows_between":2000,"halvings":0,"cell_chars":16384,"cell_head_chars":4096},"cells_cut":0,"cells_raw":0,"read":"whole","date_system":"1900"}

{"sheet":"Cleanse","index":0,"n_rows":43,"n_cols":6,"rows_kept":43,"cut":false,"hidden":false,"merged":[[2,1,8,1],[23,4,24,4],[10,1,10,4],[16,2,17,4],[20,2,21,4],[11,5,11,6],[38,2,38,4],[39,2,40,4],[41,2,41,4],[42,2,42,4],[13,0,14,7],[25,2,29,4],[31,2,31,4],[32,2,32,4],[33,2,33,4],[35,2,35,4],[23,0,24,1],[23,3,24,3]]}
[]
[null,"Instructions:",null,"         Choose the\n               Month :"]
[null,"Make your choices in yellow cells, Column E.\nClick on the cell, and select in each list :\nu The MONTH of your liver cleanse.\nv The DAY.\nw The DATE you choose.\n\nOnce done, you can print your liver cleanse planning (\"Print\" button).\n\"Reset\" button to start new choices",null,"Full moon(s)",{"$f":"IF(ISNA(HLOOKUP(E$2,Moon!$B$1:$AR$3,2,FALSE)),\"\",HLOOKUP(E$2,Moon!$B$1:$AR$3,2,FALSE))","v":""}]
[null,null,null,null,{"$f":"IF(ISNA(HLOOKUP(E$2,Moon!$B$1:$AR$3,3,FALSE)),\"\",HLOOKUP(E$2,Moon!$B$1:$AR$3,3,FALSE))","v":""}]
[null,null,null,"New moon(s)",{"$f":"IF(ISNA(HLOOKUP(E$2,Moon!$B$1:$AR$5,4,FALSE)),\"\",HLOOKUP(E$2,Moon!$B$1:$AR$5,4,FALSE))","v":""}]
[null,null,null,null,{"$f":"IF(ISNA(HLOOKUP(E$2,Moon!$B$1:$AR$5,5,FALSE)),\"\",HLOOKUP(E$2,Moon!$B$1:$AR$5,5,FALSE))","v":""}]
[null,null,null,"         Choose \n            the day :"]
[]
[null,null,null,"             Select \n               the date :"]
[]
[null,"Avoid carrying out a liver cleanse on a full moon, prefer the new moon. \nThe decreasing moon is recommended to remove toxins, so between the full moon and new moon but nearer the new moon."]
[null,"The indicated doses will be calculated based on your weight\n",null,"   Your weight : ",80,"Kg"]
[]
["Planning to print :"]
[]
["Date to begin my intestinal cleansing",null,null,"-->",{"$f":"IF(E9<>\"\",E9-27,\"\")","v":""}]
[null,"Before the first cleanse, for 3 weeks, on an empty stomach drink each morning a glass of warm water with a teaspoon of magnesium sulfate. Wait 20 minutes before breakfast.","Personal notes:"]
[null,"NB: Do not repeat taking the magnesium sulfate each time during the 3 weeks cleanse, only once before the first liver cleanse."]
[]
["Week of preparation",null,null,"-->",{"$f":"IF(E9<>\"\",E9-5,\"\")","v":""}]
[null,"For 6 days, drink each day 0.5 to 1 teaspoon of malic acid diluted in 1 liter of water.\nDrink it slowly during the day, between meals. Never during meal, never half an hour before, never during the two hours following a meal, and never in the evening.","Personal notes:"]
[null,"NB: The sixth day, it should be drunk in the morning and only half a liter is needed."]
[]
["The 6th day of preparation (day of the liver flush)",null,null,"-->",{"$f":"IF(E9<>\"\",E9,\"\")","v":""}]
[]
[null,"Avoid taking medication, vitamins or food supplements, unless prescribed.","Personal notes :"]
[null,"Do not eat proteins or fats, avoid sugar, spices, milk, butter, cheese, ham, processed food, etc… in summary only fruits and vegetables are accepted."]
[null,"Have a light breakfast, oat flakes with water, or simply fruits."]
[null,"At noon choose vegetables, or a purely vegeteble soup (no butter !)."]
[null,"Do not eat anything after 2:00 pm, only drink water (warm or moderate, not cold)."]
[]
["06:00 pm",{"$f":"CONCATENATE(\"Drink \",Moon!$F$39,\"ml of water with \",Moon!$F$35,\" soup spoon of magnesium sulfate.\")","v":"Drink 180ml of water with 1 soup spoon of magnesium sulfate."}]
["08:00 pm",{"$f":"B32","v":"Drink 180ml of water with 1 soup spoon of magnesium sulfate."}]
["09:45 pm",{"$f":"CONCATENATE(\"Prepare \",Moon!$F$22,\"ml of grapefruit juice (remove pulp with sieve) + \",Moon!$F$25,\"ml of olive oil + \",Moon!$F$28,\"gr of Ornithine + \",Moon!$F$31,\" gouts of black walnut tincture.\")","v":"Prepare 180ml of grapefruit juice (remove pulp with sieve) + 120ml of olive oil + 2,5gr of Ornithine + 20 gouts of black walnut tincture."}]
[null,"Shake everything in an airtight jar until the mixture is homogeneous.\nIf need be, go to the toilet for the last time, but without exceeding for more than 5 minutes the schedule of 10:00 pm."]
["10:00 pm","Drink the oil mixture next to the bed. Lie down immediately after on your back, your head higher than your belly. Remain immobile in this position for at least 20 minutes, do not speak. Sleep if possible, don’t drink anything before 2 am in the morning. If needed, you can go to the toilet during the night."]
[]
["7th day (a morning for evacuating)",null,null,"-->",{"$f":"IF(E9<>\"\",E9+1,\"\")","v":""}]
["06:00 am",{"$f":"B32","v":"Drink 180ml of water with 1 soup spoon of magnesium sulfate."},"Personal notes: "]
["08:00 am",{"$f":"B32","v":"Drink 180ml of water with 1 soup spoon of magnesium sulfate."}]
[null,"If you are thirsty, drink some water, but not immediately after having drunk the magnesium sulfate, wait at least 20 minutes."]
["10:00 am","you can drink fruit juice. Half an hour later you can eat fruit."]
["12:00","Normal but light meal. In the following days it's best to consume a light meal."]

{"sheet":"Moon","index":1,"n_rows":1554,"n_cols":52,"rows_kept":1554,"cut":false,"hidden":true,"merged":[[36,4,36,5],[32,4,32,5],[25,4,25,5],[28,4,28,5],[7,1,7,2],[19,4,19,5],[18,4,18,5],[22,4,22,5]]}
[null,"2020-10-01","2020-11-01","2020-12-01","2021-01-01","2021-02-01","2021-03-01","2021-04-01","2021-05-01","2021-06-01","2021-07-01","2021-08-01","2021-09-01","2021-10-01","2021-11-01","2021-12-01","2022-01-01","2022-02-01","2022-03-01","2022-04-01","2022-05-01","2022-06-01","2022-07-01","2022-08-01","2022-09-01","2022-10-01","2022-11-01","2022-12-01","2023-01-01","2023-02-01","2023-03-01","2023-04-01","2023-05-01","2023-06-01","2023-07-01","2023-08-01","2023-09-01","2023-10-01","2023-11-01","2023-12-01","2024-01-01","2024-02-01","2024-03-01","2024-04-01","2024-05-01","2024-06-01","2024-07-01","2024-08-01","2024-09-01","2024-10-01","2024-11-01","2024-12-01"]
["Full moon","2020-10-01","2020-11-30","2020-12-30","2021-01-28","2021-02-27","2021-03-28","2021-04-27","2021-05-26","2021-06-24","2021-07-24","2021-08-22","2021-09-21","2021-10-20","2021-11-19","2021-12-19","2022-01-17","2022-02-16","2022-03-18","2022-04-16","2022-05-16","2022-06-14","2022-07-13","2022-08-12","2022-09-10","2022-10-09","2022-11-08","2022-12-08","2023-01-06","2023-02-05","2023-03-07","2023-04-06","2023-05-05","2023-06-04","2023-07-03","2023-08-01","2023-09-29","2023-10-28","2023-11-27","2023-12-27","2024-01-25","2024-02-24","2024-03-25","2024-04-23","2024-05-23","2024-06-22","2024-07-21","2024-08-19","2024-09-18","2024-10-17","2024-11-15","2024-12-15"]
[null,"2020-10-31",{"$error":"#N/A"},{"$error":"#N/A"},{"$error":"#N/A"},{"$error":"#N/A"},{"$error":"#N/A"},{"$error":"#N/A"},{"$error":"#N/A"},{"$error":"#N/A"},{"$error":"#N/A"},{"$error":"#N/A"},{"$error":"#N/A"},{"$error":"#N/A"},{"$error":"#N/A"},{"$error":"#N/A"},{"$error":"#N/A"},{"$error":"#N/A"},{"$error":"#N/A"},{"$error":"#N/A"},{"$error":"#N/A"},{"$error":"#N/A"},{"$error":"#N/A"},{"$error":"#N/A"},{"$error":"#N/A"},{"$error":"#N/A"},{"$error":"#N/A"},{"$error":"#N/A"},{"$error":"#N/A"},"2020-10-31",{"$error":"#N/A"},{"$error":"#N/A"},{"$error":"#N/A"},{"$error":"#N/A"},{"$error":"#N/A"},"2023-08-31",{"$error":"#N/A"},{"$error":"#N/A"},{"$error":"#N/A"},{"$error":"#N/A"},{"$error":"#N/A"},{"$error":"#N/A"},{"$error":"#N/A"},{"$error":"#N/A"},{"$error":"#N/A"},{"$error":"#N/A"},{"$error":"#N/A"},{"$error":"#N/A"},{"$error":"#N/A"},{"$error":"#N/A"},{"$error":"#N/A"},{"$error":"#N/A"}]
["New moon","2020-10-16","2020-11-15","2020-12-14","2021-01-13","2021-02-11","2021-03-13","2021-04-12","2021-05-11","2021-06-10","2021-07-10","2021-08-08","2021-09-07","2021-10-06","2021-11-04","2021-12-04","2022-01-02","2022-02-01","2022-03-02","2022-04-01","2022-05-30","2022-06-29","2022-07-28","2022-08-27","2022-09-25","2022-10-25","2022-11-23","2022-12-23","2023-01-21","2023-02-20","2023-03-21","2023-04-20","2023-05-19","2023-06-18","2023-07-17","2023-08-16","2023-09-15","2023-10-14","2023-11-13","2023-12-12","2024-01-11","2024-02-09","2024-03-10","2024-04-08","2024-05-08","2024-06-06","2024-07-05","2024-08-04","2024-09-03","2024-10-02","2024-11-01","2024-12-01"]
[null,{"$error":"#N/A"},{"$error":"#N/A"},{"$error":"#N/A"},{"$error":"#N/A"},{"$error":"#N/A"},{"$error":"#N/A"},{"$error":"#N/A"},{"$error":"#N/A"},{"$error":"#N/A"},{"$error":"#N/A"},{"$error":"#N/A"},{"$error":"#N/A"},{"$error":"#N/A"},{"$error":"#N/A"},"2019-08-30",{"$error":"#N/A"},{"$error":"#N/A"},{"$error":"#N/A"},"2022-04-30",{"$error":"#N/A"},{"$error":"#N/A"},{"$error":"#N/A"},{"$error":"#N/A"},{"$error":"#N/A"},{"$error":"#N/A"},{"$error":"#N/A"},{"$error":"#N/A"},{"$error":"#N/A"},{"$error":"#N/A"},{"$error":"#N/A"},{"$error":"#N/A"},{"$error":"#N/A"},{"$error":"#N/A"},{"$error":"#N/A"},{"$error":"#N/A"},{"$error":"#N/A"},{"$error":"#N/A"},{"$error":"#N/A"},{"$error":"#N/A"},{"$error":"#N/A"},{"$error":"#N/A"},{"$error":"#N/A"},{"$error":"#N/A"},{"$error":"#N/A"},{"$error":"#N/A"},{"$error":"#N/A"},{"$error":"#N/A"},{"$error":"#N/A"},{"$error":"#N/A"},{"$error":"#N/A"},"2024-12-31"]
[]
[null,null,null,null,null,null,null,null,null,null,null,null,null,"Ornithine","Black \nwalnut ","Magnesium\n sulfate","water&\nmagnesium sulfate",null,"Dates","Jour","Mois","Année","Code","Compte","Code recherche","Dates"]
["Année choisie","Days",null,null,"Dates possibles",null,null,null,null,null,null,null,null,2.5,20,null,null,null,"2020-10-11",{"$f":"WEEKDAY(S8)","v":1},{"$f":"MONTH(S8)","v":10},{"$f":"YEAR(S8)","v":2020},{"$f":"T8&U8","v":"110"},1,{"$f":"V8&U8&T8&X8","v":"20201011"},{"$f":"S8","v":"2020-10-11"}]
[{"$f":"YEAR(Cleanse!E2)","v":1900},"Monday",2,null,1,{"$f":"IFERROR(VLOOKUP($A$9&$A$11&$A$13&E9,$Y$8:$Z$2000,2,FALSE),\"\")","v":""},{"$f":"IF(F9<>\"\",MONTH(F9),\"\")","v":""},{"$f":"IF(G9=$A$11,F9,IF(G10=$A$11,F10,IF(G11=$A$11,F11,\"\")))","v":""},null,null,null,null,35,1,10,"1/2",150,null,"2020-10-18",1,10,2020,"110",{"$f":"IF(V9&W9=V8&W8,X8+1,1)","v":2},"20201012","2020-10-18"]
["Mois Choisi","Tuesday",3,null,2,{"$f":"IFERROR(VLOOKUP($A$9&$A$11&$A$13&E10,$Y$8:$Z$2000,2,FALSE),\"\")","v":""},{"$f":"IF(F10<>\"\",MONTH(F10),\"\")","v":""},{"$f":"IF(G10=$A$11,IF(F10<>H9,F10,IF(G11=$A$11,F11,\"\")),\"\")","v":""},null,null,null,null,36,1,10,"1/2",150,null,"2020-10-25",1,10,2020,"110",3,"20201013","2020-10-25"]
[{"$f":"MONTH(Cleanse!E2)","v":1},"Wednesday",4,null,3,{"$f":"IFERROR(VLOOKUP($A$9&$A$11&$A$13&E11,$Y$8:$Z$2000,2,FALSE),\"\")","v":""},"",{"$f":"IF(G11=$A$11,IF(F11<>H9,IF(F11<>H10,F11,\"\"),\"\"),\"\")","v":""},null,null,null,null,37,1.5,10,"1/2",150,null,"2020-10-12",2,10,2020,"210",1,"20201021","2020-10-12"]
["Jour choisi","Thursday",5,null,4,{"$f":"IFERROR(VLOOKUP($A$9&$A$11&$A$13&E12,$Y$8:$Z$2000,2,FALSE),\"\")","v":""},"",{"$f":"IF(G12=$A$11,IF(F12<>H10,IF(F12<>H11,F12,\"\"),\"\"),\"\")","v":""},null,null,null,null,38,1.5,10,"1/2",150,null,"2020-10-19",2,10,2020,"210",2,{"$f":"V12&U12&T12&X12","v":"20201022"},"2020-10-19"]
[{"$f":"VLOOKUP(Cleanse!E7,Moon!B9:C15,2,FALSE)","v":{"$error":"#N/A"}},"Friday",6,null,5,{"$f":"IFERROR(VLOOKUP($A$9&$A$11&$A$13&E13,$Y$8:$Z$2000,2,FALSE),\"\")","v":""},"",{"$f":"IF(G13=$A$11,IF(F13<>H11,IF(F13<>H12,F13,\"\"),\"\"),\"\")","v":""},null,null,null,null,39,1.5,10,"1/2",150,null,"2020-10-26",2,10,2020,"210",3,{"$f":"V13&U13&T13&X13","v":"20201023"},"2020-10-26"]
[null,"Saturday",7,null,null,null,null,null,null,null,null,null,40,1.5,15,"1/2",150,null,"2020-10-13",3,10,2020,"310",1,{"$f":"V14&U14&T14&X14","v":"20201031"},"2020-10-13"]
[null,"Sunday",1,null,null,null,null,null,null,null,null,null,41,1.5,15,"1/2",150,null,"2020-10-20",3,10,2020,"310",2,{"$f":"V15&U15&T15&X15","v":"20201032"},"2020-10-20"]
[null,null,null,null,null,null,null,null,null,null,null,null,42,1.5,15,"1/2",150,null,"2020-10-27",3,10,2020,"310",3,{"$f":"V16&U16&T16&X16","v":"20201033"},"2020-10-27"]
["Logically, nothing should be changed in this page.",null,null,null,null,null,null,null,null,null,null,null,43,1.5,15,"1/2",150,null,"2020-10-07",4,10,2020,"410",1,{"$f":"V17&U17&T17&X8","v":"20201041"},"2020-10-07"]
["But the dates of Full Moon and New Moon will be updated by changing the ORANGE value range, and the blue cells too.",null,null,null,null,null,null,null,null,null,null,null,44,1.5,15,"1/2",150,null,"2020-10-14",4,10,2020,"410",2,{"$f":"V18&U18&T18&X18","v":"20201042"},"2020-10-14"]
[null,null,null,null,"Link weight/dosage",null,null,null,null,null,null,null,45,2,15,1,180,null,"2020-10-21",4,10,2020,"410",3,"20201043","2020-10-21"]
[null,null,null,null,"Water for the grapefruit (ml)",null,null,null,null,null,null,null,46,2,15,1,180,null,"2020-10-28",4,10,2020,"410",4,"20201044","2020-10-28"]
[null,null,null,null,80,180,null,null,null,null,null,null,47,2,15,1,180,null,"2020-10-08",5,10,2020,"510",1,"20201051","2020-10-08"]
[null,null,null,null,{"$f":"IF(Cleanse!$E$12=0,80,IF(Cleanse!$E$12>80,80,IF(Cleanse!$E$12<36,36,Cleanse!$E$12)))","v":80},{"$f":"IF(E22=E21,F21,(TRUNC(((E22/E21)*F21)/10)+1)*10)","v":180},null,null,null,null,null,null,48,2,15,1,180,null,"2020-10-15",5,10,2020,"510",2,"20201052","2020-10-15"]
[null,null,null,null,"Olive oil (ml)",null,null,null,null,null,null,null,49,2,15,1,180,null,"2020-10-22",5,10,2020,"510",3,"20201053","2020-10-22"]
[null,null,null,null,80,120,null,null,null,null,null,null,50,2,20,1,180,null,"2020-10-29",5,10,2020,"510",4,"20201054","2020-10-29"]
[null,null,null,null,{"$f":"E22","v":80},{"$f":"IF(E25=E24,F24,(TRUNC(((E25/E24)*F24)/10)+1)*10)","v":120},null,null,null,null,null,null,51,2,20,1,180,null,"2020-10-09",6,10,2020,"610",1,"20201061","2020-10-09"]
[null,null,null,null,"Ornithine (gr)",null,null,null,null,null,null,null,52,2,20,1,180,null,"2020-10-16",6,10,2020,"610",2,"20201062","2020-10-16"]
[null,null,null,null,80,2.5,null,null,null,null,null,null,53,2,20,1,180,null,"2020-10-23",6,10,2020,"610",3,"20201063","2020-10-23"]
[null,null,null,null,{"$f":"E22","v":80},{"$f":"VLOOKUP(E28,M9:N54,2)","v":2.5},null,null,null,null,null,null,54,2,20,1,180,null,"2020-10-30",6,10,2020,"610",4,"20201064","2020-10-30"]
[null,null,null,null,"Black walnut tincture (gout)",null,null,null,null,null,null,null,55,2.5,20,1,180,null,"2020-10-10",7,10,2020,"710",1,"20201071","2020-10-10"]
[null,null,null,null,80,20,null,null,null,null,null,null,56,2.5,20,1,180,null,"2020-10-17",7,10,2020,"710",2,"20201072","2020-10-17"]
[null,null,null,null,{"$f":"E22","v":80},{"$f":"VLOOKUP(E31,M9:O54,3)","v":20},null,null,null,null,null,null,57,2.5,20,1,180,null,"2020-10-24",7,10,2020,"710",3,"20201073","2020-10-24"]
[null,null,null,null,null,null,null,null,null,null,null,null,58,2.5,20,1,180,null,"2020-10-31",7,10,2020,"710",4,"20201074","2020-10-31"]
[null,null,null,null,"Magnesium sulfate (soup spoon)",null,null,null,null,null,null,null,59,2.5,20,1,180,null,"2020-11-01",1,11,2020,"111",1,"20201111","2020-11-01"]
[null,null,null,null,80,null,null,null,null,null,null,null,60,2.5,20,1,180,null,"2020-11-08",1,11,2020,"111",2,"20201112","2020-11-08"]
[null,null,null,null,{"$f":"E22","v":80},{"$f":"VLOOKUP(E35,M9:P54,4)","v":1},null,null,null,null,null,null,61,2.5,20,1,180,null,"2020-11-15",1,11,2020,"111",3,"20201113","2020-11-15"]
[null,null,null,null,null,null,null,null,null,null,null,null,62,2.5,20,1,180,null,"2020-11-22",1,11,2020,"111",4,"20201114","2020-11-22"]
[null,null,null,null,"Water for magnesium sulfate",null,null,null,null,null,null,null,63,2.5,20,1,180,null,"2020-11-29",1,11,2020,"111",5,"20201115","2020-11-29"]
[null,null,null,null,80,null,null,null,null,null,null,null,64,2.5,20,1,180,null,"2020-11-02",2,11,2020,"211",1,"20201121","2020-11-02"]
[null,null,null,null,{"$f":"E22","v":80},{"$f":"VLOOKUP(E39,M9:Q54,5)","v":180},null,null,null,null,null,null,65,2.5,20,1,180,null,"2020-11-09",2,11,2020,"211",2,"20201122","2020-11-09"]
[null,null,null,null,null,null,null,null,null,null,null,null,66,2.5,20,1,180,null,"2020-11-16",2,11,2020,"211",3,"20201123","2020-11-16"]
[null,null,null,null,null,null,null,null,null,null,null,null,67,2.5,20,1,180,null,"2020-11-23",2,11,2020,"211",4,"20201124","2020-11-23"]
[null,null,null,null,null,null,null,null,null,null,null,null,68,2.5,20,1,180,null,"2020-11-30",2,11,2020,"211",5,"20201125","2020-11-30"]
[{"$f":"CONCATENATE(\"Préparer \",F22,\"ml de jus de pamplemousse (sans la pulpe) + \",F25,\"ml d’huile d’olive + \",F28,\"gr d’Ornithine + \",F31,\"gouttesdebroudenoixnoires.\")","v":"Préparer 180ml de jus de pamplemousse (sans la pulpe) + 120ml d’huile d’olive + 2,5gr d’Ornithine + 20gouttesdebroudenoixnoires."},null,null,null,null,null,null,null,null,null,null,null,69,2.5,20,1,180,null,"2020-11-03",3,11,2020,"311",1,"20201131","2020-11-03"]
[null,null,null,null,null,null,null,null,null,null,null,null,70,2.5,20,1,180,null,"2020-11-10",3,11,2020,"311",2,"20201132","2020-11-10"]
[null,null,null,null,null,null,null,null,null,null,null,null,71,2.5,20,1,180,null,"2020-11-17",3,11,2020,"311",3,"20201133","2020-11-17"]
[null,null,null,null,null,null,null,null,null,null,null,null,72,2.5,20,1,180,null,"2020-11-24",3,11,2020,"311",4,"20201134","2020-11-24"]
[null,null,null,null,null,null,null,null,null,null,null,null,73,2.5,20,1,180,null,"2020-11-04",4,11,2020,"411",1,"20201141","2020-11-04"]
[null,null,null,null,null,null,null,null,null,null,null,null,74,2.5,20,1,180,null,"2020-11-11",4,11,2020,"411",2,"20201142","2020-11-11"]
[null,null,null,null,null,null,null,null,null,null,null,null,75,2.5,20,1,180,null,"2020-11-18",4,11,2020,"411",3,"20201143","2020-11-18"]
[null,null,null,null,null,null,null,null,null,null,null,null,76,2.5,20,1,180,null,"2020-11-25",4,11,2020,"411",4,"20201144","2020-11-25"]
[null,null,null,null,null,null,null,null,null,null,null,null,77,2.5,20,1,180,null,"2020-11-05",5,11,2020,"511",1,"20201151","2020-11-05"]
[null,null,null,null,null,null,null,null,null,null,null,null,78,2.5,20,1,180,null,"2020-11-12",5,11,2020,"511",2,"20201152","2020-11-12"]
[null,null,null,null,null,null,null,null,null,null,null,null,79,2.5,20,1,180,null,"2020-11-19",5,11,2020,"511",3,"20201153","2020-11-19"]
[null,null,null,null,null,null,null,null,null,null,null,null,80,{"$f":"$N$8*M54/80","v":2.5},20,1,180,null,"2020-11-26",5,11,2020,"511",4,"20201154","2020-11-26"]
[null,null,null,null,null,null,null,null,null,null,null,null,null,null,null,null,null,null,"2020-11-06",6,11,2020,"611",1,"20201161","2020-11-06"]
[null,null,null,null,null,null,null,null,null,null,null,null,null,null,null,null,null,null,"2020-11-13",6,11,2020,"611",2,"20201162","2020-11-13"]
[null,null,null,null,null,null,null,null,null,null,null,null,null,null,null,null,null,null,"2020-11-20",6,11,2020,"611",3,"20201163","2020-11-20"]
[null,null,null,null,null,null,null,null,null,null,null,null,null,null,null,null,null,null,"2020-11-27",6,11,2020,"611",4,"20201164","2020-11-27"]
[null,null,null,null,null,null,null,null,null,null,null,null,null,null,null,null,null,null,"2020-11-07",7,11,2020,"711",1,"20201171","2020-11-07"]
[null,null,null,null,null,null,null,null,null,null,null,null,null,null,null,null,null,null,"2020-11-14",7,11,2020,"711",2,"20201172","2020-11-14"]
[null,null,null,null,null,null,null,null,null,null,null,null,null,null,null,null,null,null,"2020-11-21",7,11,2020,"711",3,"20201173","2020-11-21"]
[null,null,null,null,null,null,null,null,null,null,null,null,null,null,null,null,null,null,"2020-11-28",7,11,2020,"711",4,"20201174","2020-11-28"]
[null,null,null,null,null,null,null,null,null,null,null,null,null,null,null,null,null,null,"2020-12-06",1,12,2020,"112",1,"20201211","2020-12-06"]
[null,null,null,null,null,null,null,null,null,null,null,null,null,null,null,null,null,null,"2020-12-13",1,12,2020,"112",2,"20201212","2020-12-13"]
[null,null,null,null,null,null,null,null,null,null,null,null,null,null,null,null,null,null,"2020-12-20",1,12,2020,"112",3,"20201213","2020-12-20"]
[null,null,null,null,null,null,null,null,null,null,null,null,null,null,null,null,null,null,"2020-12-27",1,12,2020,"112",4,"20201214","2020-12-27"]
[null,null,null,null,null,null,null,null,null,null,null,null,null,null,null,null,null,null,"2020-12-07",2,12,2020,"212",1,"20201221","2020-12-07"]
[null,null,null,null,null,null,null,null,null,null,null,null,null,null,null,null,null,null,"2020-12-14",2,12,2020,"212",2,"20201222","2020-12-14"]
[null,null,null,null,null,null,null,null,null,null,null,null,null,null,null,null,null,null,"2020-12-21",2,12,2020,"212",3,"20201223","2020-12-21"]
[null,null,null,null,null,null,null,null,null,null,null,null,null,null,null,null,null,null,"2020-12-28",2,12,2020,"212",4,"20201224","2020-12-28"]
[null,null,null,null,null,null,null,null,null,null,null,null,null,null,null,null,null,null,"2020-12-01",3,12,2020,"312",1,"20201231","2020-12-01"]
[null,null,null,null,null,null,null,null,null,null,null,null,null,null,null,null,null,null,"2020-12-08",{"$f":"WEEKDAY(S72)","v":3},{"$f":"MONTH(S72)","v":12},{"$f":"YEAR(S72)","v":2020},{"$f":"T72&U72","v":"312"},2,"20201232",{"$f":"S72","v":"2020-12-08"}]
[null,null,null,null,null,null,null,null,null,null,null,null,null,null,null,null,null,null,"2020-12-15",3,12,2020,"312",{"$f":"IF(V73&W73=V72&W72,X72+1,1)","v":3},"20201233","2020-12-15"]
[null,null,null,null,null,null,null,null,null,null,null,null,null,null,null,null,null,null,"2020-12-22",3,12,2020,"312",4,"20201234","2020-12-22"]
[null,null,null,null,null,null,null,null,null,null,null,null,null,null,null,null,null,null,"2020-12-29",3,12,2020,"312",5,"20201235","2020-12-29"]
[null,null,null,null,null,null,null,null,null,null,null,null,null,null,null,null,null,null,"2020-12-02",4,12,2020,"412",1,"20201241","2020-12-02"]
[null,null,null,null,null,null,null,null,null,null,null,null,null,null,null,null,null,null,"2020-12-09",4,12,2020,"412",2,"20201242","2020-12-09"]
[null,null,null,null,null,null,null,null,null,null,null,null,null,null,null,null,null,null,"2020-12-16",4,12,2020,"412",3,"20201243","2020-12-16"]
[null,null,null,null,null,null,null,null,null,null,null,null,null,null,null,null,null,null,"2020-12-23",4,12,2020,"412",4,"20201244","2020-12-23"]
[null,null,null,null,null,null,null,null,null,null,null,null,null,null,null,null,null,null,"2020-12-30",4,12,2020,"412",5,"20201245","2020-12-30"]
{"$rows_left_out":1474}